{"text_format":"1","workbook":"xlsx","n_sheets":11,"sheets":["Menu","MIDIA","PRODUTO","ORÇAMENTO","CUSTOS","RECEITAS","CRONOGRAMA","RELAT_MIDIAS","RELAT_INDIV","Dash","Instruções"],"not_rendered":{"charts":5,"images":13,"macros":1,"external_links":0,"defined_names":31,"comments":0,"pivot_tables":4},"unopened":[],"bounds":{"document_bytes":16777216,"sheet_cells":100000,"rows_first":2000,"rows_last":500,"rows_between":2000,"halvings":0,"cell_chars":16384,"cell_head_chars":4096},"cells_cut":0,"cells_raw":0,"read":"whole","date_system":"1900"}

{"sheet":"Menu","index":0,"n_rows":0,"n_cols":0,"rows_kept":0,"cut":false,"hidden":false,"merged":[]}

{"sheet":"MIDIA","index":1,"n_rows":19,"n_cols":6,"rows_kept":19,"cut":false,"hidden":false,"merged":[[12,1,13,1],[12,3,13,3],[12,4,13,4],[12,5,13,5],[11,3,11,5]]}
[]
[]
[]
[]
[]
[]
[]
[]
[]
[]
[]
[null,"Cadastro de Tipos de Mídias\nInsira tipos de mídias usadas em sua empresa",null,"Cadastro de Mídias Utilizadas\nInsira as mídias usadas em sua empresa"]
[null,"Tipo de Mídia",null,"Mídia","Tipo de Mídia","Observações"]
[]
[null,"Online",null,"Redes Sociais","Online"]
[null,"Offline",null,"Revistas","Offline"]
[null,null,null,"Jornais","Offline"]
[null,null,null,"Loja Física","Offline"]
[null,null,null,"Site","Online"]

{"sheet":"PRODUTO","index":2,"n_rows":46,"n_cols":8,"rows_kept":46,"cut":false,"hidden":false,"merged":[[11,1,11,3],[11,4,11,7],[23,6,23,7],[13,4,13,5],[15,4,15,5],[17,4,17,5],[19,4,19,5],[21,4,21,5],[23,4,23,5],[13,6,13,7],[15,6,15,7],[17,6,17,7],[19,6,19,7],[21,6,21,7],[13,2,13,3],[15,2,15,3],[45,1,45,7],[37,1,37,7],[38,1,38,7],[39,1,39,7],[40,1,40,7],[41,1,41,7],[42,1,42,7],[43,1,43,7],[17,2,17,3],[19,2,19,3],[21,2,21,3],[23,2,23,3],[44,1,44,7],[27,6,27,7],[27,4,27,5],[25,1,25,7]]}
[]
[]
[]
[]
[]
[]
[]
[]
[]
[]
[]
[null,"Produtos\nInsira as informações relacionadas aos seus produtos.",null,null,"Praça - Localização e Canais\nInsira as informações relacionadas a Localização e aos Canais de Venda"]
[]
[null,"O que o cliente espera dos seus produtos / serviços?","Sorvetes gostosos e deliciosos.",null,"Em quais locais (ou tipo de mídia) os clientes procuram seus produtos?",null,"Internet (site, redes sociais)"]
[]
[null,"Qual a imagem o produto/serviço quer passar?","Refrescancia e saborosos.",null,"Em qual cidade e bairro sua empresa está localizada?",null,"Pederneiras-SP, Bairro Euclydes Pinheiro"]
[]
[null,"Quais atributos eles precisam ter?","Sorvetes gelados e saborosos.",null,"Como você pode acessar canais de distribuição?",null,"Fazendo parcerias."]
[]
[null,"Como pretende trabalhar essa marca?","Disponibilizando canais de vendas online e facilidade na entrega ao cliente.",null,"Qual o seu foco geográfico (internacional, nacional, regional, estadual, municipal, de bairro, local)?",null,"Nacional."]
{"$rows_left_out":27}
{"sheet":"ORÇAMENTO","index":3,"n_rows":30,"n_cols":27,"rows_kept":30,"cut":false,"hidden":false,"merged":[[11,1,11,14]]}
[]
[]
[]
[]
[]
[]
[]
[]
[]
[]
[]
[null,"Promoção - Orçamento\nInsira os orçamentos previstos para cada mídia cadastrada."]
[]
[null,"Orçamento","Janeiro","Fevereiro","Março","Abril","Maio","Junho","Julho","Agosto","Setembro","Outubro","Novembro","Dezembro","Total"]
[null,{"$f":"IF(MIDIA!D15=\"\",\"\",MIDIA!D15)","v":"Redes Sociais"},100,200,150,150,100,100,100,100,100,100,100,100,{"$f":"SUM(C15:N15)","v":1400},null,null,null,null,null,null,null,null,null,null,null,{"$f":"IFERROR(VLOOKUP(B15,MIDIA!$D$15:$E$30,2,0),\"\")","v":"Online"}]
[null,{"$f":"IF(MIDIA!D16=\"\",\"\",MIDIA!D16)","v":"Revistas"},50,50,50,50,50,50,50,50,50,50,50,50,{"$f":"SUM(C16:N16)","v":600},null,null,null,null,null,null,null,null,null,null,null,{"$f":"IFERROR(VLOOKUP(B16,MIDIA!$D$15:$E$30,2,0),\"\")","v":"Offline"}]
[null,{"$f":"IF(MIDIA!D17=\"\",\"\",MIDIA!D17)","v":"Jornais"},30,30,30,30,30,30,30,30,30,30,30,30,360,null,null,null,null,null,null,null,null,null,null,null,{"$f":"IFERROR(VLOOKUP(B17,MIDIA!$D$15:$E$30,2,0),\"\")","v":"Offline"}]
[null,{"$f":"IF(MIDIA!D18=\"\",\"\",MIDIA!D18)","v":"Loja Física"},300,300,300,300,300,300,300,300,300,300,300,300,3600,null,null,null,null,null,null,null,null,null,null,null,{"$f":"IFERROR(VLOOKUP(B18,MIDIA!$D$15:$E$30,2,0),\"\")","v":"Offline"}]
[null,{"$f":"IF(MIDIA!D19=\"\",\"\",MIDIA!D19)","v":"Site"},150,150,150,150,150,150,150,150,150,150,150,150,1800,null,null,null,null,null,null,null,null,null,null,null,{"$f":"IFERROR(VLOOKUP(B19,MIDIA!$D$15:$E$30,2,0),\"\")","v":"Online"}]
[null,{"$f":"IF(MIDIA!D20=\"\",\"\",MIDIA!D20)","v":""},null,null,null,null,null,null,null,null,null,null,null,null,0,null,null,null,null,null,null,null,null,null,null,null,{"$f":"IFERROR(VLOOKUP(B20,MIDIA!$D$15:$E$30,2,0),\"\")","v":""}]
{"$rows_left_out":11}
{"sheet":"CUSTOS","index":4,"n_rows":30,"n_cols":27,"rows_kept":30,"cut":false,"hidden":false,"merged":[[11,1,11,14]]}
[]
[]
[]
[]
[]
[]
[]
[]
[]
[]
[]
[null,"Promoção - Custos\nInsira os custos realizados para cada mídia cadastrada."]
[]
[null,"Orçamento","Janeiro","Fevereiro","Março","Abril","Maio","Junho","Julho","Agosto","Setembro","Outubro","Novembro","Dezembro","Total"]
[null,{"$f":"IF(MIDIA!D15=\"\",\"\",MIDIA!D15)","v":"Redes Sociais"},50,200,200,200,200,200,200,200,200,200,200,200,{"$f":"SUM(C15:N15)","v":2250},null,null,null,null,null,null,null,null,null,null,null,{"$f":"IFERROR(VLOOKUP(B15,MIDIA!$D$15:$E$30,2,0),\"\")","v":"Online"}]
[null,{"$f":"IF(MIDIA!D16=\"\",\"\",MIDIA!D16)","v":"Revistas"},100,80,120,120,130,140,150,160,170,180,190,200,{"$f":"SUM(C16:N16)","v":1740},null,null,null,null,null,null,null,null,null,null,null,{"$f":"IFERROR(VLOOKUP(B16,MIDIA!$D$15:$E$30,2,0),\"\")","v":"Offline"}]
[null,{"$f":"IF(MIDIA!D17=\"\",\"\",MIDIA!D17)","v":"Jornais"},null,null,null,null,null,null,null,null,null,null,null,null,0,null,null,null,null,null,null,null,null,null,null,null,{"$f":"IFERROR(VLOOKUP(B17,MIDIA!$D$15:$E$30,2,0),\"\")","v":"Offline"}]
[null,{"$f":"IF(MIDIA!D18=\"\",\"\",MIDIA!D18)","v":"Loja Física"},200,200,null,null,null,null,null,null,null,null,null,null,400,null,null,null,null,null,null,null,null,null,null,null,{"$f":"IFERROR(VLOOKUP(B18,MIDIA!$D$15:$E$30,2,0),\"\")","v":"Offline"}]
[null,{"$f":"IF(MIDIA!D19=\"\",\"\",MIDIA!D19)","v":"Site"},100,100,100,100,100,100,100,100,100,100,100,100,1200,null,null,null,null,null,null,null,null,null,null,null,{"$f":"IFERROR(VLOOKUP(B19,MIDIA!$D$15:$E$30,2,0),\"\")","v":"Online"}]
[null,{"$f":"IF(MIDIA!D20=\"\",\"\",MIDIA!D20)","v":""},null,null,null,null,null,null,null,null,null,null,null,null,0,null,null,null,null,null,null,null,null,null,null,null,{"$f":"IFERROR(VLOOKUP(B20,MIDIA!$D$15:$E$30,2,0),\"\")","v":""}]
{"$rows_left_out":11}
{"sheet":"RECEITAS","index":5,"n_rows":30,"n_cols":27,"rows_kept":30,"cut":false,"hidden":false,"merged":[[11,1,11,14]]}
[]
[]
[]
[]
[]
[]
[]
[]
[]
[]
[]
[null,"Promoção - Receitas\nInsira as receitas que obteve para cada mídia cadastrada. Essas receitas são o retorno dos investimentos realizados."]
[]
[null,"Orçamento","Janeiro","Fevereiro","Março","Abril","Maio","Junho","Julho","Agosto","Setembro","Outubro","Novembro","Dezembro","Total"]
[null,{"$f":"IF(MIDIA!D15=\"\",\"\",MIDIA!D15)","v":"Redes Sociais"},1000,1000,1000,1000,1000,1000,1000,1000,1000,1000,1000,1000,{"$f":"SUM(C15:N15)","v":12000},null,null,null,null,null,null,null,null,null,null,null,{"$f":"IFERROR(VLOOKUP(B15,MIDIA!$D$15:$E$30,2,0),\"\")","v":"Online"}]
[null,{"$f":"IF(MIDIA!D16=\"\",\"\",MIDIA!D16)","v":"Revistas"},500,500,500,500,500,500,500,500,500,500,500,500,{"$f":"SUM(C16:N16)","v":6000},null,null,null,null,null,null,null,null,null,null,null,{"$f":"IFERROR(VLOOKUP(B16,MIDIA!$D$15:$E$30,2,0),\"\")","v":"Offline"}]
[null,{"$f":"IF(MIDIA!D17=\"\",\"\",MIDIA!D17)","v":"Jornais"},null,null,null,null,null,null,null,null,null,null,null,null,0,null,null,null,null,null,null,null,null,null,null,null,{"$f":"IFERROR(VLOOKUP(B17,MIDIA!$D$15:$E$30,2,0),\"\")","v":"Offline"}]
[null,{"$f":"IF(MIDIA!D18=\"\",\"\",MIDIA!D18)","v":"Loja Física"},50,50,50,50,50,50,50,50,50,50,50,50,600,null,null,null,null,null,null,null,null,null,null,null,{"$f":"IFERROR(VLOOKUP(B18,MIDIA!$D$15:$E$30,2,0),\"\")","v":"Offline"}]
[null,{"$f":"IF(MIDIA!D19=\"\",\"\",MIDIA!D19)","v":"Site"},300,300,300,300,300,300,300,300,300,300,300,300,3600,null,null,null,null,null,null,null,null,null,null,null,{"$f":"IFERROR(VLOOKUP(B19,MIDIA!$D$15:$E$30,2,0),\"\")","v":"Online"}]
[null,{"$f":"IF(MIDIA!D20=\"\",\"\",MIDIA!D20)","v":""},null,null,null,null,null,null,null,null,null,null,null,null,0,null,null,null,null,null,null,null,null,null,null,null,{"$f":"IFERROR(VLOOKUP(B20,MIDIA!$D$15:$E$30,2,0),\"\")","v":""}]
{"$rows_left_out":11}
{"sheet":"CRONOGRAMA","index":6,"n_rows":31,"n_cols":52,"rows_kept":31,"cut":false,"hidden":false,"merged":[[13,20,13,23],[11,1,11,14],[13,4,13,7],[13,8,13,11],[13,12,13,15],[13,16,13,19],[13,48,13,51],[13,24,13,27],[13,28,13,31],[13,32,13,35],[13,36,13,39],[13,40,13,43],[13,44,13,47]]}
[]
[]
[]
[]
[]
[]
[]
[]
[]
[]
[]
[null,"Cronograma\nInsira as atividades programadas por mídia."]
[]
[null,null,null,null,"Janeiro",null,null,null,"Fevereiro",null,null,null,"Março",null,null,null,"Abril",null,null,null,"Maio",null,null,null,"Junho",null,null,null,"Julho",null,null,null,"Agosto",null,null,null,"Setembro",null,null,null,"Outubro",null,null,null,"Novembro",null,null,null,"Dezembro"]
[null,"Mídia","Orçamento","Duração\n(em semanas)","Semana 1","Semana 2","Semana 3","Semana 4","Semana 5","Semana 6","Semana 7","Semana 8","Semana 9","Semana 10","Semana 11","Semana 12","Semana 13","Semana 14","Semana 15","Semana 16","Semana 17","Semana 18","Semana 19","Semana 20","Semana 21","Semana 22","Semana 23","Semana 24","Semana 25","Semana 26","Semana 27","Semana 28","Semana 29","Semana 30","Semana 31","Semana 32","Semana 33","Semana 34","Semana 35","Semana 36","Semana 37","Semana 38","Semana 39","Semana 40","Semana 41","Semana 42","Semana 43","Semana 44","Semana 45","Semana 46","Semana 47","Semana 48"]
[null,{"$f":"IF(MIDIA!D15=\"\",\"\",MIDIA!D15)","v":"Redes Sociais"},{"$f":"ORÇAMENTO!O15","v":1400},{"$f":"IF(B16=\"\",\"\",COUNTA(E16:AZ16))","v":26},"Programada",null,null,null,"Não Realizada",null,null,null,"Não Realizada",null,"Programada",null,"Não Realizada",null,"Programada",null,"Realizada",null,null,"Programada","Programada","Realizada",null,"Realizada","Realizada",null,null,null,"Programada","Realizada",null,"Não Realizada","Não Realizada",null,"Realizada","Programada","Não Realizada","Realizada","Não Realizada","Não Realizada","Realizada",null,"Não Realizada",null,"Não Realizada",null,null,"Realizada"]
[null,{"$f":"IF(MIDIA!D16=\"\",\"\",MIDIA!D16)","v":"Revistas"},{"$f":"ORÇAMENTO!O16","v":600},{"$f":"IF(B17=\"\",\"\",COUNTA(E17:AZ17))","v":19},"Não Realizada","Realizada","Não Realizada","Programada",null,null,null,null,null,"Realizada",null,"Não Realizada",null,"Não Realizada",null,"Programada",null,"Realizada","Não Realizada",null,"Não Realizada",null,"Não Realizada",null,null,"Não Realizada",null,"Não Realizada",null,null,null,null,null,"Não Realizada",null,null,null,null,null,null,null,"Realizada",null,"Programada",null,"Realizada","Programada"]
[null,{"$f":"IF(MIDIA!D17=\"\",\"\",MIDIA!D17)","v":"Jornais"},{"$f":"ORÇAMENTO!O17","v":360},7,"Realizada","Realizada",null,null,"Não Realizada","Não Realizada",null,null,null,null,null,null,null,null,null,null,null,null,null,null,null,null,null,null,null,null,"Não Realizada",null,null,"Realizada","Programada"]
[null,{"$f":"IF(MIDIA!D18=\"\",\"\",MIDIA!D18)","v":"Loja Física"},{"$f":"ORÇAMENTO!O18","v":3600},2,null,"Realizada",null,null,null,"Programada"]
[null,{"$f":"IF(MIDIA!D19=\"\",\"\",MIDIA!D19)","v":"Site"},{"$f":"ORÇAMENTO!O19","v":1800},0]
{"$rows_left_out":12}
{"sheet":"RELAT_MIDIAS","index":7,"n_rows":36,"n_cols":8,"rows_kept":36,"cut":false,"hidden":false,"merged":[]}
[]
[]
[]
[]
[]
[]
[]
[]
[]
[]
[]
[null,"Mídias","Orçamento","Custos","Receitas","% do Orçamento Utilizado","% da Receita em Relação ao Custo","Resultado"]
[null,{"$f":"IF(MIDIA!D15=\"\",\"\",MIDIA!D15)","v":"Redes Sociais"},{"$f":"IF(B13=\"\",\"\",ORÇAMENTO!O15)","v":1400},{"$f":"IF(B13=\"\",\"\",CUSTOS!O15)","v":2250},{"$f":"IF(B13=\"\",\"\",RECEITAS!O15)","v":12000},{"$f":"IF(B13=\"\",\"\",IF(C13=0,\"Não orçado\",IFERROR(IF((D13/C13)>1,1,D13/C13),\"\")))","v":1},{"$f":"IF(B13=\"\",\"\",IF(E13=0,\"Não apurado\",IFERROR(E13/D13,0)))","v":5.333333333333333},{"$f":"IF(B13=\"\",\"\",E13-D13)","v":9750}]
[null,{"$f":"IF(MIDIA!D16=\"\",\"\",MIDIA!D16)","v":"Revistas"},{"$f":"IF(B14=\"\",\"\",ORÇAMENTO!O16)","v":600},{"$f":"IF(B14=\"\",\"\",CUSTOS!O16)","v":1740},{"$f":"IF(B14=\"\",\"\",RECEITAS!O16)","v":6000},{"$f":"IF(B14=\"\",\"\",IF(C14=0,\"Não orçado\",IFERROR(IF((D14/C14)>1,1,D14/C14),\"\")))","v":1},{"$f":"IF(B14=\"\",\"\",IF(E14=0,\"Não apurado\",IFERROR(E14/D14,0)))","v":3.4482758620689653},{"$f":"IF(B14=\"\",\"\",E14-D14)","v":4260}]
[null,{"$f":"IF(MIDIA!D17=\"\",\"\",MIDIA!D17)","v":"Jornais"},{"$f":"IF(B15=\"\",\"\",ORÇAMENTO!O17)","v":360},{"$f":"IF(B15=\"\",\"\",CUSTOS!O17)","v":0},{"$f":"IF(B15=\"\",\"\",RECEITAS!O17)","v":0},0,"Não apurado",0]
[null,{"$f":"IF(MIDIA!D18=\"\",\"\",MIDIA!D18)","v":"Loja Física"},{"$f":"IF(B16=\"\",\"\",ORÇAMENTO!O18)","v":3600},{"$f":"IF(B16=\"\",\"\",CUSTOS!O18)","v":400},{"$f":"IF(B16=\"\",\"\",RECEITAS!O18)","v":600},0.1111111111111111,1.5,200]
[null,{"$f":"IF(MIDIA!D19=\"\",\"\",MIDIA!D19)","v":"Site"},{"$f":"IF(B17=\"\",\"\",ORÇAMENTO!O19)","v":1800},{"$f":"IF(B17=\"\",\"\",CUSTOS!O19)","v":1200},{"$f":"IF(B17=\"\",\"\",RECEITAS!O19)","v":3600},0.66666666666666663,3,2400]
[null,{"$f":"IF(MIDIA!D20=\"\",\"\",MIDIA!D20)","v":""},{"$f":"IF(B18=\"\",\"\",ORÇAMENTO!O20)","v":""},{"$f":"IF(B18=\"\",\"\",CUSTOS!O20)","v":""},{"$f":"IF(B18=\"\",\"\",RECEITAS!O20)","v":""},"","",""]
[null,{"$f":"IF(MIDIA!D21=\"\",\"\",MIDIA!D21)","v":""},{"$f":"IF(B19=\"\",\"\",ORÇAMENTO!O21)","v":""},{"$f":"IF(B19=\"\",\"\",CUSTOS!O21)","v":""},{"$f":"IF(B19=\"\",\"\",RECEITAS!O21)","v":""},"","",""]
[null,{"$f":"IF(MIDIA!D22=\"\",\"\",MIDIA!D22)","v":""},{"$f":"IF(B20=\"\",\"\",ORÇAMENTO!O22)","v":""},{"$f":"IF(B20=\"\",\"\",CUSTOS!O22)","v":""},{"$f":"IF(B20=\"\",\"\",RECEITAS!O22)","v":""},"","",""]
{"$rows_left_out":17}
{"sheet":"RELAT_INDIV","index":8,"n_rows":20,"n_cols":15,"rows_kept":20,"cut":false,"hidden":false,"merged":[[11,2,11,3]]}
[]
[]
[]
[]
[]
[]
[]
[]
[]
[]
[]
[null,"Selecione uma mídia:","Revistas"]
[null,null,2,3,4,5,6,7,8,9,10,11,12,13,14]
[null,null,"Janeiro","Fevereiro","Março","Abril","Maio","Junho","Julho","Agosto","Setembro","Outubro","Novembro","Dezembro","Total"]
[null,"Orçamento",{"$f":"IFERROR(VLOOKUP($C12,ORÇAMENTO!$B$15:$O$30,C$13,0),\"\")","v":50},{"$f":"IFERROR(VLOOKUP($C12,ORÇAMENTO!$B$15:$O$30,D$13,0),\"\")","v":50},{"$f":"IFERROR(VLOOKUP($C12,ORÇAMENTO!$B$15:$O$30,E$13,0),\"\")","v":50},{"$f":"IFERROR(VLOOKUP($C12,ORÇAMENTO!$B$15:$O$30,F$13,0),\"\")","v":50},{"$f":"IFERROR(VLOOKUP($C12,ORÇAMENTO!$B$15:$O$30,G$13,0),\"\")","v":50},{"$f":"IFERROR(VLOOKUP($C12,ORÇAMENTO!$B$15:$O$30,H$13,0),\"\")","v":50},{"$f":"IFERROR(VLOOKUP($C12,ORÇAMENTO!$B$15:$O$30,I$13,0),\"\")","v":50},{"$f":"IFERROR(VLOOKUP($C12,ORÇAMENTO!$B$15:$O$30,J$13,0),\"\")","v":50},{"$f":"IFERROR(VLOOKUP($C12,ORÇAMENTO!$B$15:$O$30,K$13,0),\"\")","v":50},{"$f":"IFERROR(VLOOKUP($C12,ORÇAMENTO!$B$15:$O$30,L$13,0),\"\")","v":50},{"$f":"IFERROR(VLOOKUP($C12,ORÇAMENTO!$B$15:$O$30,M$13,0),\"\")","v":50},{"$f":"IFERROR(VLOOKUP($C12,ORÇAMENTO!$B$15:$O$30,N$13,0),\"\")","v":50},{"$f":"SUM(C15:N15)","v":600}]
[null,"Custos",{"$f":"IFERROR(VLOOKUP($C12,CUSTOS!$B$15:$O$30,C$13,0),\"\")","v":100},{"$f":"IFERROR(VLOOKUP($C12,CUSTOS!$B$15:$O$30,D$13,0),\"\")","v":80},{"$f":"IFERROR(VLOOKUP($C12,CUSTOS!$B$15:$O$30,E$13,0),\"\")","v":120},{"$f":"IFERROR(VLOOKUP($C12,CUSTOS!$B$15:$O$30,F$13,0),\"\")","v":120},{"$f":"IFERROR(VLOOKUP($C12,CUSTOS!$B$15:$O$30,G$13,0),\"\")","v":130},{"$f":"IFERROR(VLOOKUP($C12,CUSTOS!$B$15:$O$30,H$13,0),\"\")","v":140},{"$f":"IFERROR(VLOOKUP($C12,CUSTOS!$B$15:$O$30,I$13,0),\"\")","v":150},{"$f":"IFERROR(VLOOKUP($C12,CUSTOS!$B$15:$O$30,J$13,0),\"\")","v":160},{"$f":"IFERROR(VLOOKUP($C12,CUSTOS!$B$15:$O$30,K$13,0),\"\")","v":170},{"$f":"IFERROR(VLOOKUP($C12,CUSTOS!$B$15:$O$30,L$13,0),\"\")","v":180},{"$f":"IFERROR(VLOOKUP($C12,CUSTOS!$B$15:$O$30,M$13,0),\"\")","v":190},{"$f":"IFERROR(VLOOKUP($C12,CUSTOS!$B$15:$O$30,N$13,0),\"\")","v":200},{"$f":"SUM(C16:N16)","v":1740}]
[null,"Receitas",{"$f":"IFERROR(VLOOKUP($C12,RECEITAS!$B$15:$O$30,C$13,0),\"\")","v":500},{"$f":"IFERROR(VLOOKUP($C12,RECEITAS!$B$15:$O$30,D$13,0),\"\")","v":500},{"$f":"IFERROR(VLOOKUP($C12,RECEITAS!$B$15:$O$30,E$13,0),\"\")","v":500},{"$f":"IFERROR(VLOOKUP($C12,RECEITAS!$B$15:$O$30,F$13,0),\"\")","v":500},{"$f":"IFERROR(VLOOKUP($C12,RECEITAS!$B$15:$O$30,G$13,0),\"\")","v":500},{"$f":"IFERROR(VLOOKUP($C12,RECEITAS!$B$15:$O$30,H$13,0),\"\")","v":500},{"$f":"IFERROR(VLOOKUP($C12,RECEITAS!$B$15:$O$30,I$13,0),\"\")","v":500},{"$f":"IFERROR(VLOOKUP($C12,RECEITAS!$B$15:$O$30,J$13,0),\"\")","v":500},{"$f":"IFERROR(VLOOKUP($C12,RECEITAS!$B$15:$O$30,K$13,0),\"\")","v":500},{"$f":"IFERROR(VLOOKUP($C12,RECEITAS!$B$15:$O$30,L$13,0),\"\")","v":500},{"$f":"IFERROR(VLOOKUP($C12,RECEITAS!$B$15:$O$30,M$13,0),\"\")","v":500},{"$f":"IFERROR(VLOOKUP($C12,RECEITAS!$B$15:$O$30,N$13,0),\"\")","v":500},6000]
[null,"% do Orçamento Utilizado",{"$f":"IF(C15=0,\"Não orçado\",IFERROR(IF((C16/C15)>1,1,C16/C15),\"\"))","v":1},{"$f":"IF(D15=0,\"Não orçado\",IFERROR(IF((D16/D15)>1,1,D16/D15),\"\"))","v":1},1,1,1,1,1,1,1,1,1,1,1]
[null,"% da Receita em Relação ao Custo",{"$f":"IF(C17=0,\"Não apurado\",IFERROR(C17/C16,0))","v":5},{"$f":"IF(D17=0,\"Não apurado\",IFERROR(D17/D16,0))","v":6.25},4.166666666666667,4.166666666666667,3.8461538461538463,3.5714285714285716,3.3333333333333335,3.125,2.9411764705882355,2.7777777777777777,2.6315789473684212,2.5,3.4482758620689653]
[null,"Resultado",{"$f":"C17-C16","v":400},{"$f":"D17-D16","v":420},380,380,370,360,350,340,330,320,310,300,4260]
{"$rows_left_out":1}
{"sheet":"Dash","index":9,"n_rows":70,"n_cols":15,"rows_kept":70,"cut":false,"hidden":false,"merged":[]}
[]
[]
[]
[]
[]
[]
[]
[]
[]
[]
[]
[]
[]
[]
[]
[]
[]
[]
[]
[]
{"$rows_left_out":51}
{"sheet":"Instruções","index":10,"n_rows":0,"n_cols":0,"rows_kept":0,"cut":false,"hidden":false,"merged":[]}